Reaction Details
TargetPlatelet-activating factor receptor
LigandBDBM50011609
Substrate/Competitorn/a
Meas. Tech.ChEBML_56498
IC50 7±n/a nM
Citation Walser, AFlynn, TMason, CCrowley, HMaresca, CYaremko, BO'Donnell, M Triazolobenzo- and triazolothienodiazepines as potent antagonists of platelet activating factor. J Med Chem34:1209-21 (1991) Platelet-activating factor receptor
Name:Platelet-activating factor receptor
Type:Enzyme Catalytic Domain
Mol. Mass.:39219.60
Organism:Homo sapiens (Human)
Description:PAF Platelet activating factor PTAFR HUMAN::P25105
Residue:342
BDBM50011609
NameBDBM50011609
Synonyms:7-Chloro-1-{3-[4-(2-chloro-phenyl)-9-methyl-6H-1-thia-5,7,8,9a-tetraaza-cyclopenta[e]azulen-2-yl]-prop-2-ynyl}-3,4-dihydro-1H-quinolin-2-one | CHEMBL20323
TypeSmall organic molecule
Emp. Form.C27H19Cl2N5OS
Mol. Mass.532.444
SMILESCc1nnc2CN=C(c3cc(sc3-n12)C#CCN1C(=O)CCc2ccc(Cl)cc12)c1ccccc1Cl