Reaction Details
TargetPlatelet-activating factor receptor
LigandBDBM50011624
Substrate/Competitorn/a
Meas. Tech.ChEBML_56498
IC50 5±n/a nM
Citation Walser, AFlynn, TMason, CCrowley, HMaresca, CYaremko, BO'Donnell, M Triazolobenzo- and triazolothienodiazepines as potent antagonists of platelet activating factor. J Med Chem34:1209-21 (1991) Platelet-activating factor receptor
Name:Platelet-activating factor receptor
Type:Enzyme Catalytic Domain
Mol. Mass.:39219.60
Organism:Homo sapiens (Human)
Description:PAF Platelet activating factor PTAFR HUMAN::P25105
Residue:342
BDBM50011624
NameBDBM50011624
Synonyms:2-(3-Benzoimidazol-1-yl-prop-1-ynyl)-4-(2-chloro-phenyl)-9-methyl-6H-1-thia-5,7,8,9a-tetraaza-cyclopenta[e]azulene | CHEMBL277029
TypeSmall organic molecule
Emp. Form.C25H17ClN6S
Mol. Mass.468.961
SMILESCc1nnc2CN=C(c3cc(sc3-n12)C#CCn1cnc2ccccc12)c1ccccc1Cl