Reaction Details
TargetPlatelet-activating factor receptor
LigandBDBM50011661
Substrate/Competitorn/a
Meas. Tech.ChEBML_56498
IC50 5±n/a nM
Citation Walser, AFlynn, TMason, CCrowley, HMaresca, CYaremko, BO'Donnell, M Triazolobenzo- and triazolothienodiazepines as potent antagonists of platelet activating factor. J Med Chem34:1209-21 (1991) Platelet-activating factor receptor
Name:Platelet-activating factor receptor
Type:Enzyme Catalytic Domain
Mol. Mass.:39219.60
Organism:Homo sapiens (Human)
Description:PAF Platelet activating factor PTAFR HUMAN::P25105
Residue:342
BDBM50011661
NameBDBM50011661
Synonyms:2-{3-[4-(2-Chloro-phenyl)-9-methyl-6H-1-thia-5,7,8,9a-tetraaza-cyclopenta[e]azulen-2-yl]-prop-2-ynyl}-3,4-dihydro-2H-isoquinolin-1-one | CHEMBL280683
TypeSmall organic molecule
Emp. Form.C27H20ClN5OS
Mol. Mass.497.999
SMILESCc1nnc2CN=C(c3cc(sc3-n12)C#CCN1CCc2ccccc2C1=O)c1ccccc1Cl