Reaction Details
TargetPlatelet-activating factor receptor
LigandBDBM50011672
Substrate/Competitorn/a
Meas. Tech.ChEBML_56498
IC50 25±n/a nM
Citation Walser, AFlynn, TMason, CCrowley, HMaresca, CYaremko, BO'Donnell, M Triazolobenzo- and triazolothienodiazepines as potent antagonists of platelet activating factor. J Med Chem34:1209-21 (1991) Platelet-activating factor receptor
Name:Platelet-activating factor receptor
Type:Enzyme Catalytic Domain
Mol. Mass.:39219.60
Organism:Homo sapiens (Human)
Description:PAF Platelet activating factor PTAFR HUMAN::P25105
Residue:342
BDBM50011672
NameBDBM50011672
Synonyms:2-{3-[4-(2-Chloro-phenyl)-9-methyl-6H-1-thia-5,7,8,9a-tetraaza-cyclopenta[e]azulen-2-yl]-prop-2-ynyl}-6,7-dimethoxy-3,4-dihydro-2H-isoquinolin-1-one | CHEMBL20691
TypeSmall organic molecule
Emp. Form.C29H24ClN5O3S
Mol. Mass.558.051
SMILESCOc1cc2CCN(CC#Cc3cc4c(s3)-n3c(C)nnc3CN=C4c3ccccc3Cl)C(=O)c2cc1OC