Reaction Details
TargetGag-Pol polyprotein [489-587]
LigandBDBM50010497
Substrate/Competitorn/a
Meas. Tech.ChEMBL_158640 (CHEMBL763244)
IC50 65.0±n/a nM
Citation Rich, DHSun, CQVara Prasad, JVPathiasseril, AToth, MVMarshall, GRClare, MMueller, RAHouseman, K Effect of hydroxyl group configuration in hydroxyethylamine dipeptide isosteres on HIV protease inhibition. Evidence for multiple binding modes. J Med Chem34:1222-5 (1991) Gag-Pol polyprotein [489-587]
Name:Gag-Pol polyprotein [489-587]
Type:Enzyme Subunit
Mol. Mass.:10781.16
Organism:Human immunodeficiency virus type 1
Description:P04585[489-587]
Residue:99
BDBM50010497
NameBDBM50010497
Synonyms:Acetyl-Ser-Leu-Asn-Phe-[S]-[CH(OH)CH2N]Pro-Ile-Val-OMe | CHEMBL109500
TypeSmall organic molecule
Emp. Form.C42H68N8O11
Mol. Mass.861.0363
SMILESCC[C@H](C)[C@H](NC(=O)[C@@H]1CCCN1C[C@H](O)[C@H](Cc1ccccc1)NC(=O)[C@H](CC(N)=O)NC(=O)[C@H](CC(C)C)NC(=O)[C@H](CO)NC(C)=O)C(=O)N[C@@H](C(C)C)C(=O)OC