Reaction Details
TargetD(3) dopamine receptor
LigandBDBM50122048
Substrate/Competitorn/a
Meas. Tech.ChEMBL_1701704 (CHEMBL4052937)
Ki 1.4±n/a nM
Citation Michino, MBoateng, CADonthamsetti, PYano, HBakare, OMBonifazi, AEllenberger, MPKeck, TMKumar, VZhu, CVerma, RDeschamps, JRJavitch, JANewman, AHShi, L Toward Understanding the Structural Basis of Partial Agonism at the Dopamine D J Med Chem60:580-593 (2017) 
 
D(3) dopamine receptor
Name:D(3) dopamine receptor
Type:n/a
Mol. Mass.:44243.43
Organism:Homo sapiens (Human)
Description:n/a
Residue:400
BDBM50122048
NameBDBM50122048
Synonyms:1H-Indole-2-carboxylic acid {4-[4-(2,3-dichloro-phenyl)-piperazin-1-yl]-butyl}-amide N-(4-(4-(2,3-dichlorophenyl)piperazin-1-yl)butyl)-1H-indole-2-carboxamide
TypeSmall organic molecule
Emp. Form.C23H26Cl2N4O
Mol. Mass.445.385
SMILESClc1cccc(N2CCN(CCCCNC(=O)c3cc4ccccc4[nH]3)CC2)c1Cl