Reaction Details
TargetFree fatty acid receptor 1
LigandBDBM50267049
Substrate/Competitorn/a
Meas. Tech.ChEBML_1701990
Ki 310±n/a nM
Citation Jurica, EAWu, XWilliams, KNHernandez, ASNirschl, DSRampulla, RAMathur, AZhou, MCao, GXie, CJacob, BCai, HWang, TMurphy, BJLiu, HXu, CKunselman, LKHicks, MBSun, QSchnur, DMSitkoff, DFDierks, EAApedo, AMoore, DBFoster, KACvijic, MEPanemangalore, RFlynn, NAMaxwell, BDHong, YTian, YWilkes, JJZinker, BAWhaley, JMBarrish, JCRobl, JAEwing, WREllsworth, BA Discovery of Pyrrolidine-Containing GPR40 Agonists: Stereochemistry Effects a Change in Binding Mode. J Med Chem60:1417-1431 (2017) 
 
Free fatty acid receptor 1
Name:Free fatty acid receptor 1
Type:G Protein-Coupled Receptor (GPCR)
Mol. Mass.:31473.32
Organism:Homo sapiens (Human)
Description:O14842
Residue:300
BDBM50267049
NameBDBM50267049
Synonyms:CHEMBL4095599
TypeSmall organic molecule
Emp. Form.C21H25NO2
Mol. Mass.323.4287
SMILESC[C@H]1CCN([C@@H]1CC(O)=O)c1ccc(Cc2ccccc2C)cc1