Reaction Details
TargetFree fatty acid receptor 1
LigandBDBM50267117
Substrate/Competitorn/a
Meas. Tech.ChEMBL_1701991 (CHEMBL4053224)
Ki 49±n/a nM
Citation Jurica, EAWu, XWilliams, KNHernandez, ASNirschl, DSRampulla, RAMathur, AZhou, MCao, GXie, CJacob, BCai, HWang, TMurphy, BJLiu, HXu, CKunselman, LKHicks, MBSun, QSchnur, DMSitkoff, DFDierks, EAApedo, AMoore, DBFoster, KACvijic, MEPanemangalore, RFlynn, NAMaxwell, BDHong, YTian, YWilkes, JJZinker, BAWhaley, JMBarrish, JCRobl, JAEwing, WREllsworth, BA Discovery of Pyrrolidine-Containing GPR40 Agonists: Stereochemistry Effects a Change in Binding Mode. J Med Chem60:1417-1431 (2017) 
 
Free fatty acid receptor 1
Name:Free fatty acid receptor 1
Type:G Protein-Coupled Receptor (GPCR)
Mol. Mass.:31473.32
Organism:Homo sapiens (Human)
Description:O14842
Residue:300
BDBM50267117
NameBDBM50267117
Synonyms:CHEMBL4060499
TypeSmall organic molecule
Emp. Form.C28H27F4NO4
Mol. Mass.517.5119
SMILESCOc1ccc(F)c(Cc2cccc(Oc3ccc(cc3)N3C[C@H](C[C@H]3CC(O)=O)C(F)(F)F)c2C)c1