Reaction Details
TargetFree fatty acid receptor 1
LigandBDBM50267066
Substrate/Competitorn/a
Meas. Tech.ChEMBL_1701991 (CHEMBL4053224)
Ki 1300±n/a nM
Citation Jurica, EAWu, XWilliams, KNHernandez, ASNirschl, DSRampulla, RAMathur, AZhou, MCao, GXie, CJacob, BCai, HWang, TMurphy, BJLiu, HXu, CKunselman, LKHicks, MBSun, QSchnur, DMSitkoff, DFDierks, EAApedo, AMoore, DBFoster, KACvijic, MEPanemangalore, RFlynn, NAMaxwell, BDHong, YTian, YWilkes, JJZinker, BAWhaley, JMBarrish, JCRobl, JAEwing, WREllsworth, BA Discovery of Pyrrolidine-Containing GPR40 Agonists: Stereochemistry Effects a Change in Binding Mode. J Med Chem60:1417-1431 (2017) 
 
Free fatty acid receptor 1
Name:Free fatty acid receptor 1
Type:G Protein-Coupled Receptor (GPCR)
Mol. Mass.:31473.32
Organism:Homo sapiens (Human)
Description:O14842
Residue:300
BDBM50267066
NameBDBM50267066
Synonyms:CHEMBL4067052
TypeSmall organic molecule
Emp. Form.C18H18FNO3
Mol. Mass.315.3388
SMILESOC(=O)C[C@@H]1CCCN1c1ccc(Oc2ccccc2F)cc1