Reaction Details
TargetPhosphatidylinositol 4,5-bisphosphate 3-kinase catalytic subunit alpha isoform
LigandBDBM50392138
Substrate/Competitorn/a
Meas. Tech.ChEMBL_1702171 (CHEMBL4053404)
IC50 1259±n/a nM
Citation Schwehm, CKellam, BGarces, AEHill, SJKindon, NDBradshaw, TDLi, JMacdonald, SJRowedder, JEStoddart, LAStocks, MJ Design and Elaboration of a Tractable Tricyclic Scaffold To Synthesize Druglike Inhibitors of Dipeptidyl Peptidase-4 (DPP-4), Antagonists of the C-C Chemokine Receptor Type 5 (CCR5), and Highly Potent and Selective Phosphoinositol-3 Kinase? (PI3K?) Inhibitors. J Med Chem60:1534-1554 (2017) 
 
Phosphatidylinositol 4,5-bisphosphate 3-kinase catalytic subunit alpha isoform
Name:Phosphatidylinositol 4,5-bisphosphate 3-kinase catalytic subunit alpha isoform
Type:Enzyme Subunit
Mol. Mass.:124294.87
Organism:Homo sapiens (Human)
Description:P42336
Residue:1068
BDBM50392138
NameBDBM50392138
Synonyms:CHEMBL2152768
TypeSmall organic molecule
Emp. Form.C28H33FN6O2
Mol. Mass.504.599
SMILESCC(C)(O)C1CCN(Cc2ccc3nc(nc(N4CCOCC4)c3n2)-c2c(F)ccc3[nH]ccc23)CC1