Reaction Details
TargetPlatelet-activating factor receptor
LigandBDBM50011863
Substrate/Competitorn/a
Meas. Tech.ChEMBL_154998 (CHEMBL767102)
IC50 400±n/a nM
Citation Walser, AFlynn, TMason, CCrowley, HMaresca, CO'Donnell, M Thienotriazolodiazepines as platelet-activating factor antagonists. Steric limitations for the substituent in position 2. J Med Chem34:1440-6 (1991) Platelet-activating factor receptor
Name:Platelet-activating factor receptor
Type:Enzyme Catalytic Domain
Mol. Mass.:39219.60
Organism:Homo sapiens (Human)
Description:PAF Platelet activating factor PTAFR HUMAN::P25105
Residue:342
BDBM50011863
NameBDBM50011863
Synonyms:4-(2-Chloro-phenyl)-9-methyl-2-(2-pyridin-2-yl-vinyl)-6H-1-thia-5,7,8,9a-tetraaza-cyclopenta[e]azulene | CHEMBL285926
TypeSmall organic molecule
Emp. Form.C22H16ClN5S
Mol. Mass.417.914
SMILESCc1nnc2CN=C(c3cc(\C=C/c4ccccn4)sc3-n12)c1ccccc1Cl