Reaction Details
TargetPlatelet-activating factor receptor
LigandBDBM50011866
Substrate/Competitorn/a
Meas. Tech.ChEBML_154999
IC50 10±n/a nM
Citation Walser, AFlynn, TMason, CCrowley, HMaresca, CO'Donnell, M Thienotriazolodiazepines as platelet-activating factor antagonists. Steric limitations for the substituent in position 2. J Med Chem34:1440-6 (1991) Platelet-activating factor receptor
Name:Platelet-activating factor receptor
Type:Enzyme Catalytic Domain
Mol. Mass.:39219.60
Organism:Homo sapiens (Human)
Description:PAF Platelet activating factor PTAFR HUMAN::P25105
Residue:342
BDBM50011866
NameBDBM50011866
Synonyms:2-[2-(4-Butyl-phenyl)-ethyl]-4-(2-chloro-phenyl)-9-methyl-6H-1-thia-5,7,8,9a-tetraaza-cyclopenta[e]azulene | CHEMBL442259
TypeSmall organic molecule
Emp. Form.C27H27ClN4S
Mol. Mass.475.048
SMILESCCCCc1ccc(CCc2cc3c(s2)-n2c(C)nnc2CN=C3c2ccccc2Cl)cc1