Reaction Details
TargetPlatelet-activating factor receptor
LigandBDBM50011871
Substrate/Competitorn/a
Meas. Tech.ChEMBL_154998 (CHEMBL767102)
IC50 100±n/a nM
Citation Walser, AFlynn, TMason, CCrowley, HMaresca, CO'Donnell, M Thienotriazolodiazepines as platelet-activating factor antagonists. Steric limitations for the substituent in position 2. J Med Chem34:1440-6 (1991) Platelet-activating factor receptor
Name:Platelet-activating factor receptor
Type:Enzyme Catalytic Domain
Mol. Mass.:39219.60
Organism:Homo sapiens (Human)
Description:PAF Platelet activating factor PTAFR HUMAN::P25105
Residue:342
BDBM50011871
NameBDBM50011871
Synonyms:4-(2-Chloro-phenyl)-2-(4-isobutyl-phenylethynyl)-9-methyl-6H-1-thia-5,7,8,9a-tetraaza-cyclopenta[e]azulene | CHEMBL33139
TypeSmall organic molecule
Emp. Form.C27H23ClN4S
Mol. Mass.471.016
SMILESCC(C)Cc1ccc(cc1)C#Cc1cc2c(s1)-n1c(C)nnc1CN=C2c1ccccc1Cl