Reaction Details
TargetD(3) dopamine receptor
LigandBDBM50119391
Substrate/Competitorn/a
Meas. Tech.ChEMBL_1703546 (CHEMBL4054779)
Ki 3.5±n/a nM
Citation Stößel, ABrox, RPurkayastha, NHübner, HHocke, CPrante, OGmeiner, P Development of molecular tools based on the dopamine D Bioorg Med Chem25:3491-3499 (2017) 
 
D(3) dopamine receptor
Name:D(3) dopamine receptor
Type:n/a
Mol. Mass.:44243.43
Organism:Homo sapiens (Human)
Description:n/a
Residue:400
BDBM50119391
NameBDBM50119391
Synonyms:CHEMBL142020 Pyrazolo[1,5-a]pyridine-2-carboxylic acid {4-[4-(2-methoxy-phenyl)-piperazin-1-yl]-butyl}-amide
TypeSmall organic molecule
Emp. Form.C23H29N5O2
Mol. Mass.407.5087
SMILESCOc1ccccc1N1CCN(CCCCNC(=O)c2cc3ccccn3n2)CC1