Reaction Details
TargetTyrosine-protein kinase JAK3
LigandBDBM50267805
Substrate/Competitorn/a
Meas. Tech.ChEBML_1703588
IC50 1.000000±n/a nM
Citation Hynes, JWu, HKempson, JDuan, JJLu, ZJiang, BStachura, STokarski, JSSack, JSKhan, JALippy, JSZhang, RFPitt, SShen, GGillooly, KMcIntyre, KCarter, PHBarrish, JCNadler, SGSalter-Cid, LMFura, ASchieven, GLPitts, WJWrobleski, ST Discovery of potent and efficacious pyrrolopyridazines as dual JAK1/3 inhibitors. Bioorg Med Chem Lett27:3101-3106 (2017) 
 
Tyrosine-protein kinase JAK3
Name:Tyrosine-protein kinase JAK3
Type:Protein
Mol. Mass.:125111.08
Organism:Homo sapiens (Human)
Description:P52333
Residue:1124
BDBM50267805
NameBDBM50267805
Synonyms:CHEMBL4096795
TypeSmall organic molecule
Emp. Form.C22H25N7O
Mol. Mass.403.4802
SMILESC[C@]1(N)CC[C@@H](Nc2c(cnn3cc(cc23)-c2ccc(nc2)C#N)C(N)=O)C1(C)C