Reaction Details
TargetTyrosine-protein kinase JAK3
LigandBDBM50267852
Substrate/Competitorn/a
Meas. Tech.ChEBML_1703588
IC50 0.600000±n/a nM
Citation Hynes, JWu, HKempson, JDuan, JJLu, ZJiang, BStachura, STokarski, JSSack, JSKhan, JALippy, JSZhang, RFPitt, SShen, GGillooly, KMcIntyre, KCarter, PHBarrish, JCNadler, SGSalter-Cid, LMFura, ASchieven, GLPitts, WJWrobleski, ST Discovery of potent and efficacious pyrrolopyridazines as dual JAK1/3 inhibitors. Bioorg Med Chem Lett27:3101-3106 (2017) 
 
Tyrosine-protein kinase JAK3
Name:Tyrosine-protein kinase JAK3
Type:Protein
Mol. Mass.:125111.08
Organism:Homo sapiens (Human)
Description:P52333
Residue:1124
BDBM50267852
NameBDBM50267852
Synonyms:CHEMBL4073562
TypeSmall organic molecule
Emp. Form.C22H28N6O
Mol. Mass.392.4973
SMILESCc1cc(ccn1)-c1cc2c(N[C@@H]3CC[C@](C)(N)C3(C)C)c(cnn2c1)C(N)=O