Reaction Details
TargetTyrosine-protein kinase JAK3
LigandBDBM50267836
Substrate/Competitorn/a
Meas. Tech.ChEBML_1703588
IC50 1.3±n/a nM
Citation Hynes, JWu, HKempson, JDuan, JJLu, ZJiang, BStachura, STokarski, JSSack, JSKhan, JALippy, JSZhang, RFPitt, SShen, GGillooly, KMcIntyre, KCarter, PHBarrish, JCNadler, SGSalter-Cid, LMFura, ASchieven, GLPitts, WJWrobleski, ST Discovery of potent and efficacious pyrrolopyridazines as dual JAK1/3 inhibitors. Bioorg Med Chem Lett27:3101-3106 (2017) 
 
Tyrosine-protein kinase JAK3
Name:Tyrosine-protein kinase JAK3
Type:Protein
Mol. Mass.:125111.08
Organism:Homo sapiens (Human)
Description:P52333
Residue:1124
BDBM50267836
NameBDBM50267836
Synonyms:CHEMBL4105015
TypeSmall organic molecule
Emp. Form.C22H26ClN5O
Mol. Mass.411.928
SMILESC[C@]1(N)CC[C@@H](Nc2c(cnn3cc(cc23)-c2ccccc2Cl)C(N)=O)C1(C)C