Reaction Details
TargetTyrosine-protein kinase JAK1
LigandBDBM141473
Substrate/Competitorn/a
Meas. Tech.ChEBML_1703586
IC50 0.700000±n/a nM
Citation Hynes, JWu, HKempson, JDuan, JJLu, ZJiang, BStachura, STokarski, JSSack, JSKhan, JALippy, JSZhang, RFPitt, SShen, GGillooly, KMcIntyre, KCarter, PHBarrish, JCNadler, SGSalter-Cid, LMFura, ASchieven, GLPitts, WJWrobleski, ST Discovery of potent and efficacious pyrrolopyridazines as dual JAK1/3 inhibitors. Bioorg Med Chem Lett27:3101-3106 (2017) 
 
Tyrosine-protein kinase JAK1
Name:Tyrosine-protein kinase JAK1
Type:Protein
Mol. Mass.:133293.73
Organism:Homo sapiens (Human)
Description:P23458
Residue:1154
BDBM141473
NameBDBM141473
Synonyms:US8921368, 192
TypeSmall organic molecule
Emp. Form.C21H26N6O
Mol. Mass.378.4707
SMILESC[C@]1(N)CC[C@@H](Nc2c(cnn3cc(cc23)-c2cccnc2)C(N)=O)C1(C)C