Reaction Details
TargetGastrin/cholecystokinin type B receptor
LigandBDBM50006878
Substrate/Competitorn/a
Meas. Tech.ChEMBL_47957 (CHEMBL656245)
IC50 5.3±n/a nM
Citation Yu, MJThrasher, KJMcCowan, JRMason, NRMendelsohn, LG Quinazolinone cholecystokinin-B receptor ligands. J Med Chem34:1505-8 (1991) Gastrin/cholecystokinin type B receptor
Name:Gastrin/cholecystokinin type B receptor
Type:G Protein-Coupled Receptor (GPCR)
Mol. Mass.:48445.79
Organism:Homo sapiens (Human)
Description:Stable expression of human CCK-2 receptors in HEK 293 cells.
Residue:447
BDBM50006878
NameBDBM50006878
Synonyms:(R)-1-(1-Methyl-2-oxo-5-phenyl-2,3-dihydro-1H-benzo[e][1,4]diazepin-3-yl)-3-m-tolyl-urea (RS)-1-(1-Methyl-2-oxo-5-phenyl-2,3-dihydro-1H-benzo[e][1,4]diazepin-3-yl)-3-m-tolyl-urea 1-((R)-1-Methyl-2-oxo-5-phenyl-2,3-dihydro-1H-benzo[e][1,4]diazepin-3-yl)-3-m-tolyl-urea 1-(1-Methyl-2-oxo-5-phenyl-2,3-dihydro-1H-benzo[e][1,4]diazepin-3-yl)-3-m-tolyl-urea 1-(1-Methyl-2-oxo-5-phenyl-2,3-dihydro-1H-benzo[e][1,4]diazepin-3-yl)-3-m-tolyl-urea (L-365,260) 1-(1-Methyl-2-oxo-5-phenyl-2,3-dihydro-1H-benzo[e][1,4]diazepin-3-yl)-3-m-tolyl-urea(L-365260) 1-(1-Methyl-2-oxo-5-phenyl-2,3-dihydro-1H-benzo[e][1,4]diazepin-3-yl)-3-p-tolyl-urea L-365260 | LY-365260
TypeSmall organic molecule
Emp. Form.C24H22N4O2
Mol. Mass.398.4571
SMILESCN1c2ccccc2C(=N[C@@H](NC(=O)Nc2ccc(C)cc2)C1=O)c1ccccc1