Reaction Details
TargetInsulin receptor
LigandBDBM50011995
Substrate/Competitorn/a
Meas. Tech.ChEBML_90277
IC50 200000±n/a nM
Citation Burke, TRLi, ZHBolen, JBMarquez, VE Phosphonate-containing inhibitors of tyrosine-specific protein kinases. J Med Chem34:1577-81 (1991) Insulin receptor
Name:Insulin receptor
Type:Receptor Tyrosine Kinase
Mol. Mass.:156322.60
Organism:Homo sapiens (Human)
Description:P06213
Residue:1382
BDBM50011995
NameBDBM50011995
Synonyms:(Hydroxy-naphthalen-2-yl-methyl)-phosphonic acid hydroxy(naphthalen-2-yl)methylphosphonic acid
TypeSmall organic molecule
Emp. Form.C11H11O4P
Mol. Mass.238.1764
SMILESOP(O)(O)C(=O)c1ccc2ccccc2c1