Reaction Details
TargetThymidylate synthase
LigandBDBM50012240
Substrate/Competitorn/a
Meas. Tech.ChEBML_209778
Ki 69.0±n/a nM
Citation Appelt, KBacquet, RJBartlett, CABooth, CLFreer, STFuhry, MAGehring, MRHerrmann, SMHowland, EFJanson, CA Design of enzyme inhibitors using iterative protein crystallographic analysis. J Med Chem34:1925-34 (1991) Thymidylate synthase
Name:Thymidylate synthase
Type:Enzyme
Mol. Mass.:35718.07
Organism:Homo sapiens (Human)
Description:n/a
Residue:313
BDBM50012240
NameBDBM50012240
Synonyms:6-({[4-(Indole-1-sulfonyl)-phenyl]-prop-2-ynyl-amino}-methyl)-2-methyl-3H-quinazolin-4-one | CHEMBL299928
TypeSmall organic molecule
Emp. Form.C27H22N4O3S
Mol. Mass.482.554
SMILESCc1nc2ccc(CN(CC#C)c3ccc(cc3)S(=O)(=O)n3ccc4ccccc34)cc2c(=O)[nH]1