Reaction Details
TargetThymidylate synthase
LigandBDBM50005202
Substrate/Competitorn/a
Meas. Tech.ChEBML_209778
Ki 770.0±n/a nM
Citation Appelt, KBacquet, RJBartlett, CABooth, CLFreer, STFuhry, MAGehring, MRHerrmann, SMHowland, EFJanson, CA Design of enzyme inhibitors using iterative protein crystallographic analysis. J Med Chem34:1925-34 (1991) Thymidylate synthase
Name:Thymidylate synthase
Type:Enzyme
Mol. Mass.:35718.07
Organism:Homo sapiens (Human)
Description:n/a
Residue:313
BDBM50005202
NameBDBM50005202
Synonyms:6-[(4-Benzenesulfonyl-benzyl)-methyl-amino]-1-methyl-1H-benzo[cd]indol-2-one CHEMBL301844
TypeSmall organic molecule
Emp. Form.C25H20N2O3S
Mol. Mass.428.503
SMILESCN(Cc1ccc(cc1)S(=O)(=O)c1ccccc1)c1ccc2NC(=O)c3cccc1c23