Reaction Details
TargetMuscarinic acetylcholine receptor M4
LigandBDBM39341
Substrate/Competitorn/a
Meas. Tech.ChEBML_139254
Ki 330±n/a nM
Citation Karton, YBradbury, BJBaumgold, JPaek, RJacobson, KA Functionalized congener approach to muscarinic antagonists: analogues of pirenzepine. J Med Chem34:2133-45 (1991) Muscarinic acetylcholine receptor M4
Name:Muscarinic acetylcholine receptor M4
Type:Enzyme Catalytic Domain
Mol. Mass.:52841.70
Organism:RAT
Description:Cholinergic, muscarinic M4 CHRM4 RAT::P08485
Residue:477
BDBM39341
NameBDBM39341
Synonyms:11-[(4-methylpiperazin-1-yl)acetyl]-5,11-dihydro-6H-pyrido[2,3-b][1,4]benzodiazepin-6-one 11-[2-(4-methylpiperazin-1-yl)acetyl]-5H-pyrido[2,3-b][1,4]benzodiazepin-6-one;hydrochloride 11-[2-(4-methylpiperazino)acetyl]-5H-pyrido[2,3-b][1,4]benzodiazepin-6-one;hydrochloride MLS000069702 PIRENZEPINE DIHYDROCHLORIDE cid_185248
TypeSmall organic molecule
Emp. Form.C19H21N5O2
Mol. Mass.351.4023
SMILESCN1CCN(CC(=O)N2c3ccccc3C(=O)Nc3cccnc23)CC1