Reaction Details
TargetPepsin A
LigandBDBM912
Substrate/Competitorn/a
Meas. Tech.ChEMBL_153978 (CHEMBL762330)
IC50 7.0±n/a nM
Citation McConnell, RMFrizzell, DCamp, AEvans, AJones, WCagle, C New pepstatin analogues: synthesis and pepsin inhibition. J Med Chem34:2298-300 (1991) Pepsin A
Name:Pepsin A
Type:Enzyme
Mol. Mass.:41232.87
Organism:Porcine
Description:n/a
Residue:385
BDBM912
NameBDBM912
Synonyms:(3S,4S)-3-hydroxy-4-[(2S)-2-[(3S,4S)-3-hydroxy-6-methyl-4-[(2S)-3-methyl-2-[(2S)-3-methyl-2-(3-methylbutanamido)butanamido]butanamido]heptanamido]propanamido]-6-methylheptanoic acid Iva-Val-Val-Sta-Ala-Sta-OH PEPSTATIN US9115083, Pepstatin
TypeSmall organic molecule
Emp. Form.C34H63N5O9
Mol. Mass.685.8921
SMILESCC(C)C[C@H](NC(=O)[C@H](C)NC(=O)C[C@H](O)[C@H](CC(C)C)NC(=O)[C@@H](NC(=O)[C@@H](NC(=O)CC(C)C)C(C)C)C(C)C)[C@@H](O)CC(O)=O