Reaction Details
TargetGlycogen synthase kinase-3 beta
LigandBDBM50269439
Substrate/Competitorn/a
Meas. Tech.ChEMBL_1706606 (CHEMBL4057839)
IC50 1.2±n/a nM
Citation Kohara, TNakayama, KWatanabe, KKusaka, SISakai, DTanaka, HFukunaga, KSunada, SNabeno, MSaito, KIEguchi, JIMori, ATanaka, SBessho, TTakiguchi-Hayashi, KHorikawa, T Discovery of novel 2-(4-aryl-2-methylpiperazin-1-yl)-pyrimidin-4-ones as glycogen synthase kinase-3? inhibitors. Bioorg Med Chem Lett27:3733-3738 (2017) 
 
Glycogen synthase kinase-3 beta
Name:Glycogen synthase kinase-3 beta
Type:Enzyme
Mol. Mass.:46756.38
Organism:Homo sapiens (Human)
Description:P49841
Residue:420
BDBM50269439
NameBDBM50269439
Synonyms:CHEMBL4077048
TypeSmall organic molecule
Emp. Form.C20H21ClN6O
Mol. Mass.396.873
SMILESC[C@@H]1CN(CCN1c1nc(cc(=O)n1C)-c1ccncn1)c1ccc(Cl)cc1