Reaction Details
TargetGlycogen synthase kinase-3 beta
LigandBDBM50269447
Substrate/Competitorn/a
Meas. Tech.ChEMBL_1706628 (CHEMBL4057861)
IC50 44.0±n/a nM
Citation Usui, YUehara, FHiki, SWatanabe, KTanaka, HShouda, AYokoshima, SAritomo, KAdachi, TFukunaga, KSunada, SNabeno, MSaito, KIEguchi, JIYamagami, KAsano, STanaka, SYuki, SYoshii, NFujimura, MHorikawa, T Discovery of novel 2-(3-phenylpiperazin-1-yl)-pyrimidin-4-ones as glycogen synthase kinase-3? inhibitors. Bioorg Med Chem Lett27:3726-3732 (2017) 
 
Glycogen synthase kinase-3 beta
Name:Glycogen synthase kinase-3 beta
Type:Enzyme
Mol. Mass.:46756.38
Organism:Homo sapiens (Human)
Description:P49841
Residue:420
BDBM50269447
NameBDBM50269447
Synonyms:CHEMBL4076186
TypeSmall organic molecule
Emp. Form.C20H22ClFN6O2
Mol. Mass.432.879
SMILESCl.COc1cc(F)ccc1C1CN(CCN1)c1nc(cc(=O)n1C)-c1ccncn1