Reaction Details
TargetGlycogen synthase kinase-3 beta
LigandBDBM50269492
Substrate/Competitorn/a
Meas. Tech.ChEMBL_1706628 (CHEMBL4057861)
IC50 1.1±n/a nM
Citation Usui, YUehara, FHiki, SWatanabe, KTanaka, HShouda, AYokoshima, SAritomo, KAdachi, TFukunaga, KSunada, SNabeno, MSaito, KIEguchi, JIYamagami, KAsano, STanaka, SYuki, SYoshii, NFujimura, MHorikawa, T Discovery of novel 2-(3-phenylpiperazin-1-yl)-pyrimidin-4-ones as glycogen synthase kinase-3? inhibitors. Bioorg Med Chem Lett27:3726-3732 (2017) 
 
Glycogen synthase kinase-3 beta
Name:Glycogen synthase kinase-3 beta
Type:Enzyme
Mol. Mass.:46756.38
Organism:Homo sapiens (Human)
Description:P49841
Residue:420
BDBM50269492
NameBDBM50269492
Synonyms:CHEMBL4067532
TypeSmall organic molecule
Emp. Form.C19H19ClN6O
Mol. Mass.382.847
SMILESCn1c(nc(cc1=O)-c1ccncn1)N1CCNC(C1)c1cccc(Cl)c1