Reaction Details
TargetTyrosine-protein kinase Fgr
LigandBDBM267935
Substrate/Competitorn/a
Meas. Tech.ChEMBL_1706725 (CHEMBL4057958)
IC50 69±n/a nM
Citation Boga, SBAlhassan, ABLiu, JGuiadeen, DKrikorian, AGao, XWang, JYu, YAnand, RLiu, SYang, CWu, HCai, JZhu, HDesai, JMaloney, KGao, YDFischmann, TOPresland, JMansueto, MXu, ZLeccese, EKnemeyer, IGarlisi, CGBays, NStivers, PBrandish, PEHicks, ACooper, AKim, RMKozlowski, JA Discovery of 3-morpholino-imidazole[1,5-a]pyrazine BTK inhibitors for rheumatoid arthritis. Bioorg Med Chem Lett27:3939-3943 (2017) 
 
Tyrosine-protein kinase Fgr
Name:Tyrosine-protein kinase Fgr
Type:protein
Mol. Mass.:59469.88
Organism:Homo sapiens (Human)
Description:P09769
Residue:529
BDBM267935
NameBDBM267935
Synonyms:4-{8-amino-3-[(2R)-4-oxetan-3-ylmorpholin-2-yl]imidazo[1,5-a]pyrazin-1-yl}-N-[4-(trifluoromethyl)pyridin-2-yl]benzamide | US9718828, Example, 551
TypeSmall organic molecule
Emp. Form.C26H23F4N7O4
Mol. Mass.573.4989
SMILESCOCC(=O)N1CCO[C@H](C1)c1nc(-c2ccc(cc2F)C(=O)Nc2cc(ccn2)C(F)(F)F)c2c(N)nccn12