Reaction Details
TargetCytoplasmic tyrosine-protein kinase BMX
LigandBDBM50269555
Substrate/Competitorn/a
Meas. Tech.ChEMBL_1706719 (CHEMBL4057952)
IC50 200±n/a nM
Citation Boga, SBAlhassan, ABLiu, JGuiadeen, DKrikorian, AGao, XWang, JYu, YAnand, RLiu, SYang, CWu, HCai, JZhu, HDesai, JMaloney, KGao, YDFischmann, TOPresland, JMansueto, MXu, ZLeccese, EKnemeyer, IGarlisi, CGBays, NStivers, PBrandish, PEHicks, ACooper, AKim, RMKozlowski, JA Discovery of 3-morpholino-imidazole[1,5-a]pyrazine BTK inhibitors for rheumatoid arthritis. Bioorg Med Chem Lett27:3939-3943 (2017) 
 
Cytoplasmic tyrosine-protein kinase BMX
Name:Cytoplasmic tyrosine-protein kinase BMX
Type:Tyrosine-protein kinase
Mol. Mass.:78030.42
Organism:Homo sapiens (Human)
Description:P51813
Residue:675
BDBM50269555
NameBDBM50269555
Synonyms:CHEMBL4060757
TypeSmall organic molecule
Emp. Form.C28H27F4N7O3
Mol. Mass.585.5527
SMILESNc1nccn2c(nc(-c3ccc(cc3F)C(=O)Nc3cc(ccn3)C(F)(F)F)c12)[C@H]1CN(CCO1)C1CCOCC1