Reaction Details
TargetTyrosine-protein kinase TXK
LigandBDBM50269557
Substrate/Competitorn/a
Meas. Tech.ChEMBL_1706743 (CHEMBL4057976)
IC50 132±n/a nM
Citation Boga, SBAlhassan, ABLiu, JGuiadeen, DKrikorian, AGao, XWang, JYu, YAnand, RLiu, SYang, CWu, HCai, JZhu, HDesai, JMaloney, KGao, YDFischmann, TOPresland, JMansueto, MXu, ZLeccese, EKnemeyer, IGarlisi, CGBays, NStivers, PBrandish, PEHicks, ACooper, AKim, RMKozlowski, JA Discovery of 3-morpholino-imidazole[1,5-a]pyrazine BTK inhibitors for rheumatoid arthritis. Bioorg Med Chem Lett27:3939-3943 (2017) 
 
Tyrosine-protein kinase TXK
Name:Tyrosine-protein kinase TXK
Type:Protein
Mol. Mass.:61268.80
Organism:Homo sapiens (Human)
Description:P42681
Residue:527
BDBM50269557
NameBDBM50269557
Synonyms:CHEMBL4069387
TypeSmall organic molecule
Emp. Form.C28H27F4N7O2
Mol. Mass.569.5533
SMILESCC(C)C(=O)N1CCC[C@H](C1)c1nc(-c2ccc(cc2F)C(=O)Nc2cc(ccn2)C(F)(F)F)c2c(N)nccn12