Reaction Details
TargetTyrosine-protein kinase TXK
LigandBDBM267935
Substrate/Competitorn/a
Meas. Tech.ChEMBL_1706743 (CHEMBL4057976)
IC50 256±n/a nM
Citation Boga, SBAlhassan, ABLiu, JGuiadeen, DKrikorian, AGao, XWang, JYu, YAnand, RLiu, SYang, CWu, HCai, JZhu, HDesai, JMaloney, KGao, YDFischmann, TOPresland, JMansueto, MXu, ZLeccese, EKnemeyer, IGarlisi, CGBays, NStivers, PBrandish, PEHicks, ACooper, AKim, RMKozlowski, JA Discovery of 3-morpholino-imidazole[1,5-a]pyrazine BTK inhibitors for rheumatoid arthritis. Bioorg Med Chem Lett27:3939-3943 (2017) 
 
Tyrosine-protein kinase TXK
Name:Tyrosine-protein kinase TXK
Type:Protein
Mol. Mass.:61268.80
Organism:Homo sapiens (Human)
Description:P42681
Residue:527
BDBM267935
NameBDBM267935
Synonyms:4-{8-amino-3-[(2R)-4-oxetan-3-ylmorpholin-2-yl]imidazo[1,5-a]pyrazin-1-yl}-N-[4-(trifluoromethyl)pyridin-2-yl]benzamide | US9718828, Example, 551
TypeSmall organic molecule
Emp. Form.C26H23F4N7O4
Mol. Mass.573.4989
SMILESCOCC(=O)N1CCO[C@H](C1)c1nc(-c2ccc(cc2F)C(=O)Nc2cc(ccn2)C(F)(F)F)c2c(N)nccn12