Reaction Details
TargetTyrosine-protein kinase TXK
LigandBDBM50269556
Substrate/Competitorn/a
Meas. Tech.ChEMBL_1706743 (CHEMBL4057976)
IC50 464±n/a nM
Citation Boga, SBAlhassan, ABLiu, JGuiadeen, DKrikorian, AGao, XWang, JYu, YAnand, RLiu, SYang, CWu, HCai, JZhu, HDesai, JMaloney, KGao, YDFischmann, TOPresland, JMansueto, MXu, ZLeccese, EKnemeyer, IGarlisi, CGBays, NStivers, PBrandish, PEHicks, ACooper, AKim, RMKozlowski, JA Discovery of 3-morpholino-imidazole[1,5-a]pyrazine BTK inhibitors for rheumatoid arthritis. Bioorg Med Chem Lett27:3939-3943 (2017) 
 
Tyrosine-protein kinase TXK
Name:Tyrosine-protein kinase TXK
Type:Protein
Mol. Mass.:61268.80
Organism:Homo sapiens (Human)
Description:P42681
Residue:527
BDBM50269556
NameBDBM50269556
Synonyms:CHEMBL4075954
TypeSmall organic molecule
Emp. Form.C27H25F4N7O3
Mol. Mass.571.5261
SMILESCC(C)C(=O)N1CCO[C@H](C1)c1nc(-c2ccc(cc2F)C(=O)Nc2cc(ccn2)C(F)(F)F)c2c(N)nccn12