Reaction Details
Target5-hydroxytryptamine receptor 1A
LigandBDBM50012980
Substrate/Competitorn/a
Meas. Tech.ChEMBL_1062 (CHEMBL616387)
IC50 46000±n/a nM
Citation Schlecht, MFTsarouhtsis, DLipovac, MNDebler, EA Synthesis and serotonin binding site studies of some conformationally restricted indolylethylamine analogues based on 2-amino-3-(3'-indolyl)bicyclo[2.2.2]octane. J Med Chem33:386-94 (1990) 5-hydroxytryptamine receptor 1A
Name:5-hydroxytryptamine receptor 1A
Type:Enzyme
Mol. Mass.:46192.09
Organism:Mus musculus (Mouse)
Description:Q64264
Residue:421
BDBM50012980
NameBDBM50012980
Synonyms:5-(1H-Indol-3-yl)-6-pyrrolidin-1-yl-bicyclo[2.2.2]octan-2-one | CHEMBL128329
TypeSmall organic molecule
Emp. Form.C20H24N2O
Mol. Mass.308.4174
SMILESO=C1CC2CCC1C(C2c1c[nH]c2ccccc12)N1CCCC1