Reaction Details
TargetPlasminogen
LigandBDBM50012996
Substrate/Competitorn/a
Meas. Tech.ChEBML_155582
IC50 432000.0±n/a nM
Citation McConnell, RMBarnes, GEHoyng, CFGunn, JM New leupeptin analogues: synthesis and inhibition data. J Med Chem33:86-93 (1990) Plasminogen
Name:Plasminogen
Type:Protein
Mol. Mass.:90541.87
Organism:Rattus norvegicus
Description:Q01177
Residue:812
BDBM50012996
NameBDBM50012996
Synonyms:CHEMBL2371655 | {1-[1-(4-Amino-1-formyl-butylcarbamoyl)-2-methyl-propylcarbamoyl]-3-methyl-butyl}-carbamic acid benzyl ester
TypeSmall organic molecule
Emp. Form.C24H38N4O5
Mol. Mass.462.5823
SMILESCC(C)C[C@H](NC(=O)OCc1ccccc1)C(=O)N[C@@H](C(C)C)C(=O)N[C@@H](CCCN)C=O