Reaction Details
TargetPlasminogen
LigandBDBM50013007
Substrate/Competitorn/a
Meas. Tech.ChEBML_155582
IC50 183700±n/a nM
Citation McConnell, RMBarnes, GEHoyng, CFGunn, JM New leupeptin analogues: synthesis and inhibition data. J Med Chem33:86-93 (1990) Plasminogen
Name:Plasminogen
Type:Protein
Mol. Mass.:90541.87
Organism:Rattus norvegicus
Description:Q01177
Residue:812
BDBM50013007
NameBDBM50013007
Synonyms:CHEMBL2371644 | {1-[1-(5-Amino-1-formyl-pentylcarbamoyl)-3-methyl-butylcarbamoyl]-3-methyl-butyl}-carbamic acid benzyl ester
TypeSmall organic molecule
Emp. Form.C26H42N4O5
Mol. Mass.490.6355
SMILESCC(C)C[C@H](NC(=O)OCc1ccccc1)C(=O)N[C@@H](CC(C)C)C(=O)N[C@@H](CCCCN)C=O