Reaction Details
TargetPlasminogen
LigandBDBM50013001
Substrate/Competitorn/a
Meas. Tech.ChEBML_155582
IC50 241600±n/a nM
Citation McConnell, RMBarnes, GEHoyng, CFGunn, JM New leupeptin analogues: synthesis and inhibition data. J Med Chem33:86-93 (1990) Plasminogen
Name:Plasminogen
Type:Protein
Mol. Mass.:90541.87
Organism:Rattus norvegicus
Description:Q01177
Residue:812
BDBM50013001
NameBDBM50013001
Synonyms:CHEMBL3143646 | {1-[1-(4-Amino-1-formyl-butylcarbamoyl)-3-methyl-butylcarbamoyl]-2-phenyl-ethyl}-carbamic acid benzyl ester
TypeSmall organic molecule
Emp. Form.C28H38N4O5
Mol. Mass.510.6251
SMILESCC(C)C[C@H](NC(=O)[C@H](Cc1ccccc1)NC(=O)OCc1ccccc1)C(=O)N[C@@H](CCCN)C=O