Reaction Details
TargetSerine protease 1
LigandBDBM50013003
Substrate/Competitorn/a
Meas. Tech.ChEBML_213242
IC50 400000±n/a nM
Citation McConnell, RMBarnes, GEHoyng, CFGunn, JM New leupeptin analogues: synthesis and inhibition data. J Med Chem33:86-93 (1990) Serine protease 1
Name:Serine protease 1
Type:Enzyme
Mol. Mass.:26557.80
Organism:Homo sapiens (Human)
Description:P07477
Residue:247
BDBM50013003
NameBDBM50013003
Synonyms:CHEMBL3143639 | {1-[1-(5-Amino-1-formyl-pentylcarbamoyl)-3-methyl-butylcarbamoyl]-2-phenyl-ethyl}-carbamic acid benzyl ester
TypeSmall organic molecule
Emp. Form.C29H40N4O5
Mol. Mass.524.6517
SMILESCC(C)C[C@H](NC(=O)[C@H](Cc1ccccc1)NC(=O)OCc1ccccc1)C(=O)N[C@@H](CCCCN)C=O