Reaction Details
TargetSerine protease 1
LigandBDBM50013004
Substrate/Competitorn/a
Meas. Tech.ChEMBL_213242 (CHEMBL821451)
IC50 5200±n/a nM
Citation McConnell, RMBarnes, GEHoyng, CFGunn, JM New leupeptin analogues: synthesis and inhibition data. J Med Chem33:86-93 (1990) Serine protease 1
Name:Serine protease 1
Type:Enzyme
Mol. Mass.:26557.80
Organism:Homo sapiens (Human)
Description:P07477
Residue:247
BDBM50013004
NameBDBM50013004
Synonyms:2-Acetylamino-4-methyl-pentanoic acid [1-(1-formyl-4-ureido-butylcarbamoyl)-3-methyl-butyl]-amide | CHEMBL2371636
TypeSmall organic molecule
Emp. Form.C20H37N5O5
Mol. Mass.427.5383
SMILESCC(C)C[C@H](NC(C)=O)C(=O)N[C@@H](CC(C)C)C(=O)N[C@@H](CCCNC(N)=O)C=O