Reaction Details
TargetSerine protease 1
LigandBDBM50013007
Substrate/Competitorn/a
Meas. Tech.ChEMBL_213242 (CHEMBL821451)
IC50 195700±n/a nM
Citation McConnell, RMBarnes, GEHoyng, CFGunn, JM New leupeptin analogues: synthesis and inhibition data. J Med Chem33:86-93 (1990) Serine protease 1
Name:Serine protease 1
Type:Enzyme
Mol. Mass.:26557.80
Organism:Homo sapiens (Human)
Description:P07477
Residue:247
BDBM50013007
NameBDBM50013007
Synonyms:CHEMBL2371644 | {1-[1-(5-Amino-1-formyl-pentylcarbamoyl)-3-methyl-butylcarbamoyl]-3-methyl-butyl}-carbamic acid benzyl ester
TypeSmall organic molecule
Emp. Form.C26H42N4O5
Mol. Mass.490.6355
SMILESCC(C)C[C@H](NC(=O)OCc1ccccc1)C(=O)N[C@@H](CC(C)C)C(=O)N[C@@H](CCCCN)C=O