Reaction Details
TargetKallikrein-1
LigandBDBM50228474
Substrate/Competitorn/a
Meas. Tech.ChEMBL_92229 (CHEMBL703575)
IC50 33300±n/a nM
Citation McConnell, RMBarnes, GEHoyng, CFGunn, JM New leupeptin analogues: synthesis and inhibition data. J Med Chem33:86-93 (1990) Kallikrein-1
Name:Kallikrein-1
Type:Enzyme
Mol. Mass.:28874.69
Organism:Homo sapiens (Human)
Description:P06870
Residue:262
BDBM50228474
NameBDBM50228474
Synonyms:CHEMBL3143649
TypeSmall organic molecule
Emp. Form.C29H40N6O5
Mol. Mass.552.6651
SMILES[#6]-[#6](-[#6])-[#6]-[#6@H](-[#7]-[#6](=O)-[#8]-[#6]-c1ccccc1)-[#6](=O)-[#7]-[#6@@H](-[#6]-c1ccccc1)-[#6](=O)-[#7]-[#6@@H](-[#6]-[#6]-[#6]\[#7]=[#6](\[#7])-[#7])-[#6]=O