Reaction Details
Target5-hydroxytryptamine receptor 1A
LigandBDBM50013019
Substrate/Competitorn/a
Meas. Tech.ChEMBL_1118 (CHEMBL616063)
Ki 52±n/a nM
Citation Hillver, SEBjörk, LLi, YLSvensson, BRoss, SAndén, NEHacksell, U (S)-5-fluoro-8-hydroxy-2-(dipropylamino)tetralin: a putative 5-HT1A-receptor antagonist. J Med Chem33:1541-4 (1990) 5-hydroxytryptamine receptor 1A
Name:5-hydroxytryptamine receptor 1A
Type:G Protein-Coupled Receptor (GPCR)
Mol. Mass.:46445.29
Organism:Rattus norvegicus (rat)
Description:Binding assays were performed using rat hippocampal membranes.
Residue:422
BDBM50013019
NameBDBM50013019
Synonyms:(S)-7-(dipropylamino)-4-fluoro-5,6,7,8-tetrahydronaphthalen-1-ol (S)-UH-301 7-Dipropylamino-4-fluoro-5,6,7,8-tetrahydro-naphthalen-1-ol ((S)-UH301) UH-301
TypeSmall organic molecule
Emp. Form.C16H24FNO
Mol. Mass.265.3663
SMILESCCCN(CCC)[C@H]1CCc2c(F)ccc(O)c2C1