Reaction Details
TargetVoltage-dependent L-type calcium channel subunit alpha-1C
LigandBDBM50013025
Substrate/Competitorn/a
Meas. Tech.ChEBML_42766
Ki 14±n/a nM
Citation Natale, NRTriggle, DJPalmer, RBLefler, BJEdwards, WD 4-Isoxazolyl-1,4-dihydropyridines: biological, theoretical, and structural studies. J Med Chem33:2255-9 (1990) Voltage-dependent L-type calcium channel subunit alpha-1C
Name:Voltage-dependent L-type calcium channel subunit alpha-1C
Type:Enzyme Catalytic Domain
Mol. Mass.:248979.79
Organism:Homo sapiens (Human)
Description:Calcium channel (Type L) 0 HUMAN::Q13936
Residue:2221
BDBM50013025
NameBDBM50013025
Synonyms:2,6-Dimethyl-4-(5-methyl-3-phenyl-isoxazol-4-yl)-1,4-dihydro-pyridine-3,5-dicarboxylic acid diethyl ester | CHEMBL305903
TypeSmall organic molecule
Emp. Form.C23H26N2O5
Mol. Mass.410.4629
SMILESCCOC(=O)C1C(c2c(C)onc2-c2ccccc2)C(C(=O)OCC)=C(C)N=C1C