Reaction Details
TargetVoltage-dependent L-type calcium channel subunit alpha-1C/alpha-1D/alpha-1F/alpha-1S
LigandBDBM50013022
Substrate/Competitorn/a
Meas. Tech.ChEMBL_42764 (CHEMBL653734)
Ki 33±n/a nM
Citation Natale, NRTriggle, DJPalmer, RBLefler, BJEdwards, WD 4-Isoxazolyl-1,4-dihydropyridines: biological, theoretical, and structural studies. J Med Chem33:2255-9 (1990) Voltage-dependent L-type calcium channel subunit alpha-1C/alpha-1D/alpha-1F/alpha-1S
Name:Voltage-dependent L-type calcium channel subunit alpha-1C/alpha-1D/alpha-1F/alpha-1S
Synonyms:Voltage-gated L-type calcium channel
Type:n/a
Mol. Mass.:n/a
Description:ASSAY_ID of ChEMBL is 92767
Components:This complex has 4 components.
Component 1
Name:Voltage-dependent L-type calcium channel subunit alpha-1D
Type:PROTEIN
Mol. Mass.:245144.84
Organism:Homo sapiens (Human)
Description:ChEMBL_1350501
Residue:2161
Component 2
Name:Voltage-dependent L-type calcium channel subunit alpha-1C
Synonyms:CAC1C_HUMAN CACN2 CACNL1A1 Calcium channel (Type L) L-type calcium channel alpha-1c/beta-2/alpha2delta-1 Voltage-gated L-type calcium channel Voltage-gated calcium channel | Voltage-gated calcium channel subunit alpha Cav1.2
Type:Enzyme Catalytic Domain
Mol. Mass.:248979.79
Organism:Homo sapiens (Human)
Description:Calcium channel (Type L) 0 HUMAN::Q13936
Residue:2221
Component 3
Name:Voltage-dependent L-type calcium channel subunit alpha-1S
Synonyms:CAC1S_HUMAN CACN1 CACNL1A3 Voltage-dependent L-type calcium channel subunit alpha-1S Voltage-gated L-type calcium channel alpha-1S subunit Voltage-gated calcium channel subunit alpha Cav1.1
Type:PROTEIN
Mol. Mass.:212348.33
Organism:Homo sapiens (Human)
Description:ChEMBL_42767
Residue:1873
Component 4
Name:Voltage-dependent L-type calcium channel subunit alpha-1F
Synonyms:CAC1F_HUMAN CACNAF1 Voltage-gated calcium channel | Voltage-gated calcium channel subunit alpha Cav1.4
Type:PROTEIN
Mol. Mass.:220661.87
Organism:Homo sapiens (Human)
Description:ChEMBL_105734
Residue:1977
BDBM50013022
NameBDBM50013022
Synonyms:4-(3,5-Dimethyl-isoxazol-4-yl)-2,6-dimethyl-1,4-dihydro-pyridine-3,5-dicarboxylic acid diethyl ester | CHEMBL74944
TypeSmall organic molecule
Emp. Form.C18H24N2O5
Mol. Mass.348.3936
SMILESCCOC(=O)C1C(c2c(C)noc2C)C(C(=O)OCC)=C(C)N=C1C