Reaction Details
TargetCyclin-dependent kinase 6/G1/S-specific cyclin-D1
LigandBDBM50270303
Substrate/Competitorn/a
Meas. Tech.ChEMBL_1707962 (CHEMBL4059195)
IC50 4.1±n/a nM
Citation Wang, YZhi, YJin, QLu, SLin, GYuan, HYang, TWang, ZYao, CLing, JGuo, HLi, TJin, JLi, BZhang, LChen, YLu, T Discovery of 4-((7H-Pyrrolo[2,3-d]pyrimidin-4-yl)amino)-N-(4-((4-methylpiperazin-1-yl)methyl)phenyl)-1H-pyrazole-3-carboxamide (FN-1501), an FLT3- and CDK-Kinase Inhibitor with Potentially High Efficiency against Acute Myelocytic Leukemia. J Med Chem61:1499-1518 (2018) 
 
Cyclin-dependent kinase 6/G1/S-specific cyclin-D1
Name:Cyclin-dependent kinase 6/G1/S-specific cyclin-D1
Type:n/a
Mol. Mass.:n/a
Description:ASSAY_ID of ChEMBL is 1935149
Components:This complex has 2 components.
Component 1
Name:G1/S-specific cyclin-D1
Synonyms:B-cell lymphoma 1 protein BCL-1 oncogene CCND1 PRAD1 | PRAD1 oncogene
Type:Enzyme Subunit
Mol. Mass.:33717.70
Organism:Homo sapiens (Human)
Description:n/a
Residue:295
Component 2
Name:Cyclin-dependent kinase 6
Synonyms:CDK6 CDKN6 Cyclin-dependent kinase 6 (CDK 6) | Serine/threonine-protein kinase PLSTIRE
Type:Enzyme Subunit
Mol. Mass.:36937.42
Organism:Homo sapiens (Human)
Description:Q00534
Residue:326
BDBM50270303
NameBDBM50270303
Synonyms:CHEMBL4061686
TypeSmall organic molecule
Emp. Form.C22H24N8OS
Mol. Mass.448.544
SMILESCN1CCN(Cc2ccc(NC(=O)c3n[nH]cc3Nc3ncnc4ccsc34)cc2)CC1