Reaction Details
TargetNeuronal acetylcholine receptor subunit alpha-7
LigandBDBM50006640
Substrate/Competitorn/a
Meas. Tech.ChEMBL_1708060 (CHEMBL4059293)
EC50>100000±n/a nM
Citation Crestey, FJensen, AASoerensen, CMagnus, CBAndreasen, JTPeters, GHJKristensen, JL Dual Nicotinic Acetylcholine Receptor ?4?2 Antagonists/?7 Agonists: Synthesis, Docking Studies, and Pharmacological Evaluation of Tetrahydroisoquinolines and Tetrahydroisoquinolinium Salts. J Med Chem61:1719-1729 (2018) 
 
Neuronal acetylcholine receptor subunit alpha-7
Name:Neuronal acetylcholine receptor subunit alpha-7
Type:n/a
Mol. Mass.:56448.33
Organism:Homo sapiens (Human)
Description: CHRNA7 (NACHRA7)
Residue:502
BDBM50006640
NameBDBM50006640
Synonyms:CHEMBL593001
TypeSmall organic molecule
Emp. Form.C11H15NO2
Mol. Mass.193.2423
SMILESCOc1cc2CCN(C)Cc2cc1O