Reaction Details
TargetSialidase-4
LigandBDBM50270464
Substrate/Competitorn/a
Meas. Tech.ChEMBL_1708165 (CHEMBL4059398)
IC50 520±n/a nM
Citation Guo, TDätwyler, PDemina, ERichards, MRGe, PZou, CZheng, RFougerat, APshezhetsky, AVErnst, BCairo, CW Selective Inhibitors of Human Neuraminidase 3. J Med Chem61:1990-2008 (2018) 
 
Sialidase-4
Name:Sialidase-4
Type:PROTEIN
Mol. Mass.:51579.82
Organism:Homo sapiens (Human)
Description:ChEMBL_960637
Residue:484
BDBM50270464
NameBDBM50270464
Synonyms:CHEMBL4076203
TypeSmall organic molecule
Emp. Form.C25H26N4O7
Mol. Mass.494.4965
SMILES[H][C@]1(OC(=C[C@H](O)[C@H]1NC(C)=O)C(O)=O)[C@H](O)[C@H](O)Cn1cc(nn1)-c1ccc(cc1)-c1ccccc1