Reaction Details
TargetSialidase-2
LigandBDBM50270441
Substrate/Competitorn/a
Meas. Tech.ChEMBL_1708163 (CHEMBL4059396)
Ki 17000±n/a nM
Citation Guo, TDätwyler, PDemina, ERichards, MRGe, PZou, CZheng, RFougerat, APshezhetsky, AVErnst, BCairo, CW Selective Inhibitors of Human Neuraminidase 3. J Med Chem61:1990-2008 (2018) 
 
Sialidase-2
Name:Sialidase-2
Type:PROTEIN
Mol. Mass.:42256.20
Organism:Homo sapiens (Human)
Description:ChEMBL_960638
Residue:380
BDBM50270441
NameBDBM50270441
Synonyms:CHEMBL4099818
TypeSmall organic molecule
Emp. Form.C26H29N7O6
Mol. Mass.535.5518
SMILES[H][C@]1(OC(=C[C@H](NC(N)=N)[C@H]1NC(C)=O)C(O)=O)[C@H](O)[C@H](O)Cn1cc(nn1)-c1ccc(cc1)-c1ccccc1