Reaction Details
Target3-hydroxy-3-methylglutaryl-coenzyme A reductase
LigandBDBM50013210
Substrate/Competitorn/a
Meas. Tech.ChEBML_80477
IC50 0.014000±n/a nM
Citation Jendralla, HBaader, EBartmann, WBeck, GBergmann, AGranzer, Evon Kerekjarto, BKesseler, KKrause, RSchubert, W Synthesis and biological activity of new HMG-CoA reductase inhibitors. 2. Derivatives of 7-(1H-pyrrol-3-yl)-substituted-3,5-dihydroxyhept-6(E)-enoic (-heptanoic) acids. J Med Chem33:61-70 (1990) 3-hydroxy-3-methylglutaryl-coenzyme A reductase
Name:3-hydroxy-3-methylglutaryl-coenzyme A reductase
Type:Enzyme
Mol. Mass.:97477.10
Organism:Homo sapiens (Human)
Description:P04035
Residue:888
BDBM50013210
NameBDBM50013210
Synonyms:CHEMBL162642 | Sodium salt of 7-[4-(4-Fluoro-phenyl)-2-isopropyl-1-phenyl-1H-pyrrol-3-yl]-3,5-dihydroxy-hept-6-enoic acid
TypeSmall organic molecule
Emp. Form.C26H27FNO4
Mol. Mass.436.4958
SMILESCC(C)c1c(\C=C\[C@@H](O)C[C@@H](O)CC([O-])=O)c(cn1-c1ccccc1)-c1ccc(F)cc1