Reaction Details
TargetBeta-secretase 2
LigandBDBM50271165
Substrate/Competitorn/a
Meas. Tech.ChEMBL_1709740 (CHEMBL4119789)
Ki 0.500000±n/a nM
Citation Blass, B C ACS Med Chem Lett8:786-788 (2017) 
 
Beta-secretase 2
Name:Beta-secretase 2
Type:Protein
Mol. Mass.:56171.20
Organism:Homo sapiens (Human)
Description:Q9Y5Z0
Residue:518
BDBM50271165
NameBDBM50271165
Synonyms:CHEMBL4128375
TypeSmall organic molecule
Emp. Form.C22H20BrFN6O3S
Mol. Mass.547.4
SMILES[H][C@@]12CCC[C@@]1(NC(=N)N(C)S2(=O)=O)c1cc(NC(=O)c2nccc3cc(Br)cnc23)ccc1F