Reaction Details
TargetCysteinyl leukotriene receptor 1
LigandBDBM50013541
Substrate/Competitorn/a
Meas. Tech.ChEBML_52211
Ki 7.5±n/a nM
Citation Huang, FCGalemmo, RAJohnson, WHPoli, GBMorrissette, MMMencel, JJWarus, JDCampbell, HFNuss, GWCarnathan, GW Development of a novel series of (2-quinolinylmethoxy)phenyl-containing compounds as high-affinity leukotriene D4 receptor antagonists. 2. Effects of an additional phenyl ring on receptor affinity. J Med Chem33:1194-200 (1990) Cysteinyl leukotriene receptor 1
Name:Cysteinyl leukotriene receptor 1
Type:Enzyme Catalytic Domain
Mol. Mass.:39007.58
Organism:GUINEA PIG
Description:Leukotriene D4 0 GUINEA PIG::Q2NNR5
Residue:340
BDBM50013541
NameBDBM50013541
Synonyms:2-{4-[3-Methoxy-5-(1H-tetrazol-5-yl)-phenoxymethyl]-phenoxymethyl}-quinoline | CHEMBL18396
TypeSmall organic molecule
Emp. Form.C25H21N5O3
Mol. Mass.439.4659
SMILESCOc1cc(OCc2ccc(OCc3ccc4ccccc4n3)cc2)cc(c1)-c1nnn[nH]1